Делая
cmake ../

Получаю

— The C compiler identification is unknown
— Check for working C compiler: /usr/bin/cc
— Check for working C compiler: /usr/bin/cc — broken
CMake Error at /usr/share/cmake-2.8/Modules/CMakeTestCCompiler.cmake:61 (message):
  The C compiler "/usr/bin/cc" is not able to compile a simple test program.

  It fails with the following output:

   Change Dir: /home/seranatbat/gnuradio/build/CMakeFiles/CMakeTmp

 

  Run Build Command:/usr/bin/make «cmTryCompileExec151144209/fast»

  /usr/bin/make -f CMakeFiles/cmTryCompileExec151144209.dir/build.make
  CMakeFiles/cmTryCompileExec151144209.dir/build

  make[1]: Вход в каталог
  `/home/seranatbat/gnuradio/build/CMakeFiles/CMakeTmp'

  /usr/bin/cmake -E cmake_progress_report
  /home/seranatbat/gnuradio/build/CMakeFiles/CMakeTmp/CMakeFiles 1

  Building C object
  CMakeFiles/cmTryCompileExec151144209.dir/testCCompiler.c.o

  /usr/bin/cc -Qunused-arguments -o
  CMakeFiles/cmTryCompileExec151144209.dir/testCCompiler.c.o -c
  /home/seranatbat/gnuradio/build/CMakeFiles/CMakeTmp/testCCompiler.c

  cc: error: unrecognized command line option ‘-Qunused-arguments’

  make[1]: *** [CMakeFiles/cmTryCompileExec151144209.dir/testCCompiler.c.o]
  Ошибка 1

  make[1]: Выход из каталога
  `/home/seranatbat/gnuradio/build/CMakeFiles/CMakeTmp'

  make: *** [cmTryCompileExec151144209/fast] Ошибка 2

 

 

  CMake will not be able to correctly generate this project.
Call Stack (most recent call first):
  CMakeLists.txt:29 (project)


— Configuring incomplete, errors occurred!
See also "/home/seranatbat/gnuradio/build/CMakeFiles/CMakeOutput.log".
See also "/home/seranatbat/gnuradio/build/CMakeFiles/CMakeError.log".


читал разные форумы, так и не понял в чем, ошибка, может с ходу кто подскажет?)